Target
Vitamin D3 receptor
Ligand
BDBM50244165
Substrate
Meas. Tech.
ChEMBL_491881 (CHEMBL946411)
EC50
0.024000±n/a nM
Citation
 Shimizu, MMiyamoto, YTakaku, HMatsuo, MNakabayashi, MMasuno, HUdagawa, NDeLuca, HFIkura, TIto, N 2-Substituted-16-ene-22-thia-1alpha,25-dihydroxy-26,27-dimethyl-19-norvitamin D3 analogs: Synthesis, biological evaluation, and crystal structure. Bioorg Med Chem 16:6949-64 (2008)  
Target
Name:
Vitamin D3 receptor
Synonyms:
1,25-dihydroxyvitamin D3 receptor Nuclear receptor subfamily 1 group I member 1 Vdr Vitamin D3 receptor
Type:
PROTEIN
Mol. Mass.:
47830.18
Organism:
Mus musculus
Description:
ChEMBL_491881
Residue:
422
  
Inhibitor
Name:
BDBM50244165
Synonyms:
(1R,2S,3R,5Z,7E)-17-{(1R)-1-[(2-ethyl-2-hydroxybutyl)sulfanyl]ethyl}-2-(2-hydroxyethoxy)-9,10-secoestra-5,7,16-triene-1,3-diol (20R)-1-alpha-25-dihydroxy-2-beta-(2-hydroxyethoxy)-16-ene-22-thia-26,27-dimethyl-19,24-dinorvitamin D3 CHEMBL514116
Type:
Small organic molecule
Emp. Form.:
C28H46O5S
Mol. Mass.:
494.727
SMILES:
CCC(O)(CC)CS[C@H](C)C1=CC[C@H]2\C(CCC[C@]12C)=C\C=C1C[C@@H](O)C(OCCO)[C@H](O)C1
: