Target
Coagulation factor X
Ligand
BDBM50242831
Substrate
Meas. Tech.
ChEMBL_491893 (CHEMBL946423)
Ki
0.14±n/a nM
Citation
 Qiao, JXCheney, DLAlexander, RSSmallwood, AMKing, SRHe, KRendina, ARLuettgen, JMKnabb, RMWexler, RRLam, PY Achieving structural diversity using the perpendicular conformation of alpha-substituted phenylcyclopropanes to mimic the bioactive conformation of ortho-substituted biphenyl P4 moieties: discovery of novel, highly potent inhibitors of Factor Xa. Bioorg Med Chem Lett 18:4118-23 (2008)  
Target
Name:
Coagulation factor X
Synonyms:
Activated coagulation factor X (FXa) Coagulation factor X precursor F10 Factor X heavy chain Factor Xa Stuart-Prower factor
Type:
Enzyme
Mol. Mass.:
54726.60
Organism:
Homo sapiens (Human)
Description:
Residue:
488
  
Inhibitor
Name:
BDBM50242831
Synonyms:
3-ethyl-1-((1-(4-(1-(4-methoxyphenyl)-7-oxo-3-(trifluoromethyl)-4,5-dihydro-1H-pyrazolo[3,4-c]pyridin-6(7H)-yl)phenyl)cyclopropyl)methyl)-1-methylurea | CHEMBL517711
Type:
Small organic molecule
Emp. Form.:
C28H30F3N5O3
Mol. Mass.:
541.5647
SMILES:
CCNC(=O)N(C)CC1(CC1)c1ccc(cc1)N1CCc2c(nn(c2C1=O)-c1ccc(OC)cc1)C(F)(F)F
: