Target
Dipeptidyl peptidase 8
Ligand
BDBM50242852
Substrate
Meas. Tech.
ChEMBL_491997 (CHEMBL938680)
IC50
7300±n/a nM
Citation
 Van Goethem, SVan der Veken, PDubois, VSoroka, ALambeir, AMChen, XHaemers, AScharpé, SDe Meester, IAugustyns, K Inhibitors of dipeptidyl peptidase 8 and dipeptidyl peptidase 9. Part 2: isoindoline containing inhibitors. Bioorg Med Chem Lett 18:4159-62 (2008)  
Target
Name:
Dipeptidyl peptidase 8
Synonyms:
DPP8 DPRP-1 Dipeptidyl peptidase 8 (DPP-8) Dipeptidyl peptidase 8/9 Dipeptidyl peptidase VIII Prolyl dipeptidase DPP8
Type:
Enzyme
Mol. Mass.:
103342.62
Organism:
Homo sapiens (Human)
Description:
Q6V1X1
Residue:
898
  
Inhibitor
Name:
BDBM50242852
Synonyms:
(2S,3S)-2-amino-1-(4-fluoroisoindolin-2-yl)-3-methylpentan-1-one | CHEMBL469891
Type:
Small organic molecule
Emp. Form.:
C14H19FN2O
Mol. Mass.:
250.3119
SMILES:
CC[C@H](C)[C@H](N)C(=O)N1Cc2cccc(F)c2C1
: