Target
Sodium-dependent serotonin transporter
Ligand
BDBM50251881
Substrate
Meas. Tech.
ChEMBL_487557 (CHEMBL1013151)
Ki
38.5±n/a nM
Citation
 Zhou, DZhou, PEvrard, DAMeagher, KWebb, MHarrison, BLHuryn, DMGolembieski, JHornby, GASchechter, LESmith, DLAndree, THMewshaw, RE Studies toward the discovery of the next generation of antidepressants. Part 6: Dual 5-HT1A receptor and serotonin transporter affinity within a class of arylpiperazinyl-cyclohexyl indole derivatives. Bioorg Med Chem 16:6707-23 (2008)  
Target
Name:
Sodium-dependent serotonin transporter
Synonyms:
5-HT Transporter 5HT transporter Anandamid membrane transporter, AMT Monoamine transporters; Norepinephrine & serotonin Slc6a4 Sodium-dependent serotonin transporter (SERT) | imipramine receptor
Type:
Multi-pass membrane protein
Mol. Mass.:
70168.43
Organism:
Rattus norvegicus (rat)
Description:
P31652
Residue:
630
  
Inhibitor
Name:
BDBM50251881
Synonyms:
3-{(1,4-cis)-4-[4-(1H-Indol-4-yl)-piperazin-1-yl]-cyclohexyl}-1-isopropyl-1H-indole-5-carbonitrile | CHEMBL480935
Type:
Small organic molecule
Emp. Form.:
C30H35N5
Mol. Mass.:
465.6324
SMILES:
CC(C)n1cc([C@@H]2CC[C@@H](CC2)N2CCN(CC2)c2cccc3[nH]ccc23)c2cc(ccc12)C#N
: