Target
5-hydroxytryptamine receptor 1A
Ligand
BDBM50252279
Substrate
Meas. Tech.
ChEMBL_487560 (CHEMBL1013154)
Ki
9.1±n/a nM
Citation
 Zhou, DZhou, PEvrard, DAMeagher, KWebb, MHarrison, BLHuryn, DMGolembieski, JHornby, GASchechter, LESmith, DLAndree, THMewshaw, RE Studies toward the discovery of the next generation of antidepressants. Part 6: Dual 5-HT1A receptor and serotonin transporter affinity within a class of arylpiperazinyl-cyclohexyl indole derivatives. Bioorg Med Chem 16:6707-23 (2008)  
Target
Name:
5-hydroxytryptamine receptor 1A
Synonyms:
5-HT-1A 5-hydroxytryptamine receptor 1A (5-HT-1A) ADRB2RL1 Dopamine D2 receptor and serotonin 1a receptor HTR1A | Serotonin receptor 1A
Type:
Mol. Mass.:
46122.49
Organism:
Homo sapiens (Human)
Description:
Residue:
422
  
Inhibitor
Name:
BDBM50252279
Synonyms:
3-[(1,4-trans)-4-(4-Quinoxalin-5-yl-piperazin-1-yl)-cyclohexyl]-1H-indole-5-carbonitrile | CHEMBL518946
Type:
Small organic molecule
Emp. Form.:
C27H28N6
Mol. Mass.:
436.5514
SMILES:
N#Cc1ccc2[nH]cc([C@H]3CC[C@@H](CC3)N3CCN(CC3)c3cccc4nccnc34)c2c1
: