Target
5-hydroxytryptamine receptor 1A
Ligand
BDBM50252179
Substrate
Meas. Tech.
ChEMBL_487560 (CHEMBL1013154)
Ki
8.3±n/a nM
Citation
 Zhou, DZhou, PEvrard, DAMeagher, KWebb, MHarrison, BLHuryn, DMGolembieski, JHornby, GASchechter, LESmith, DLAndree, THMewshaw, RE Studies toward the discovery of the next generation of antidepressants. Part 6: Dual 5-HT1A receptor and serotonin transporter affinity within a class of arylpiperazinyl-cyclohexyl indole derivatives. Bioorg Med Chem 16:6707-23 (2008)  
Target
Name:
5-hydroxytryptamine receptor 1A
Synonyms:
5-HT-1A 5-hydroxytryptamine receptor 1A (5-HT-1A) ADRB2RL1 Dopamine D2 receptor and serotonin 1a receptor HTR1A | Serotonin receptor 1A
Type:
Mol. Mass.:
46122.49
Organism:
Homo sapiens (Human)
Description:
Residue:
422
  
Inhibitor
Name:
BDBM50252179
Synonyms:
5-{4-[(1,4-trans)-4-(5-Fluoro-1H-indol-3-yl)-cyclohexyl]-piperazin-1-yl}-quinoline | CHEMBL481109
Type:
Small organic molecule
Emp. Form.:
C27H29FN4
Mol. Mass.:
428.5444
SMILES:
Fc1ccc2[nH]cc([C@H]3CC[C@@H](CC3)N3CCN(CC3)c3cccc4ncccc34)c2c1
: