Target
5-hydroxytryptamine receptor 1A
Ligand
BDBM50252082
Substrate
Meas. Tech.
ChEMBL_487560 (CHEMBL1013154)
Ki
13±n/a nM
Citation
 Zhou, DZhou, PEvrard, DAMeagher, KWebb, MHarrison, BLHuryn, DMGolembieski, JHornby, GASchechter, LESmith, DLAndree, THMewshaw, RE Studies toward the discovery of the next generation of antidepressants. Part 6: Dual 5-HT1A receptor and serotonin transporter affinity within a class of arylpiperazinyl-cyclohexyl indole derivatives. Bioorg Med Chem 16:6707-23 (2008)  
Target
Name:
5-hydroxytryptamine receptor 1A
Synonyms:
5-HT-1A 5-hydroxytryptamine receptor 1A (5-HT-1A) ADRB2RL1 Dopamine D2 receptor and serotonin 1a receptor HTR1A | Serotonin receptor 1A
Type:
Mol. Mass.:
46122.49
Organism:
Homo sapiens (Human)
Description:
Residue:
422
  
Inhibitor
Name:
BDBM50252082
Synonyms:
3-[trans-4-[4-(1H-Indol-4-yl)-1-pipera-zinyl]-cyclohexyl]-2-methyl-1H-indole | CHEMBL479782
Type:
Small organic molecule
Emp. Form.:
C27H32N4
Mol. Mass.:
412.5698
SMILES:
Cc1[nH]c2ccccc2c1[C@H]1CC[C@@H](CC1)N1CCN(CC1)c1cccc2[nH]ccc12
: