Target
Cathepsin S
Ligand
BDBM50252037
Substrate
Meas. Tech.
ChEMBL_487680 (CHEMBL1009448)
IC50
15±n/a nM
Citation
 Irie, OEhara, TIwasaki, AYokokawa, FSakaki, JHirao, HKanazawa, TTeno, NHoriuchi, MUmemura, IGunji, HMasuya, KHitomi, YIwasaki, GNonomura, KTanabe, KFukaya, HKosaka, TSnell, CRHallett, A Discovery of selective and nonpeptidic cathepsin S inhibitors. Bioorg Med Chem Lett 18:3959-62 (2008)  
Target
Name:
Cathepsin S
Synonyms:
CATS_HUMAN Cathepsin S (Cat S) | cathepsin S preproprotein
Type:
Protein
Mol. Mass.:
37507.38
Organism:
Homo sapiens (Human)
Description:
P25774
Residue:
331
  
Inhibitor
Name:
BDBM50252037
Synonyms:
6-((4-(1-acetylpiperidin-4-yl)phenoxy)methyl)-7-(2-cyclohexylethyl)-7H-pyrrolo[2,3-d]pyrimidine-2-carbonitrile | CHEMBL519459
Type:
Small organic molecule
Emp. Form.:
C29H35N5O2
Mol. Mass.:
485.6205
SMILES:
CC(=O)N1CCC(CC1)c1ccc(OCc2cc3cnc(nc3n2CCC2CCCCC2)C#N)cc1
: