Target
Transporter
Ligand
BDBM50048803
Substrate
Meas. Tech.
ChEMBL_490815 (CHEMBL992752)
Ki
48±n/a nM
Citation
 Ablordeppey, SYAltundas, RBricker, BZhu, XYKumar, EVJackson, TKhan, ARoth, BL Identification of a butyrophenone analog as a potential atypical antipsychotic agent: 4-[4-(4-chlorophenyl)-1,4-diazepan-1-yl]-1-(4-fluorophenyl)butan-1-one. Bioorg Med Chem 16:7291-301 (2008)  
Target
Name:
Transporter
Synonyms:
NE transporter Norepinephrine transporter(NET)
Type:
Multi-pass membrane protein
Mol. Mass.:
69236.90
Organism:
Rattus norvegicus (rat)
Description:
Q63380
Residue:
617
  
Inhibitor
Name:
BDBM50048803
Synonyms:
5-(2-(4-(benzo[d]isothiazol-3-yl)piperazin-1-yl)ethyl)-6-chloroindolin-2-one 5-[2-(4-Benzo[d]isothiazol-3-yl-piperazin-1-yl)-ethyl]-6-chloro-1,3-dihydro-indol-2-one (Ziprasidone) CHEMBL708 ZIPRASIDONE | ZIPRASIDONE HYDROCHLORIDE
Type:
Small organic molecule
Emp. Form.:
C21H21ClN4OS
Mol. Mass.:
412.936
SMILES:
Clc1cc2NC(=O)Cc2cc1CCN1CCN(CC1)c1nsc2ccccc12
: