Target
Histamine H3 receptor
Ligand
BDBM50263294
Substrate
Meas. Tech.
ChEMBL_489014 (CHEMBL986355)
IC50
1.6±n/a nM
Citation
 Nagase, TMizutani, TIshikawa, SSekino, ESasaki, TFujimura, TIto, SMitobe, YMiyamoto, YYoshimoto, RTanaka, TIshihara, ATakenaga, NTokita, SFukami, TSato, N Synthesis, structure-activity relationships, and biological profiles of a quinazolinone class of histamine H3 receptor inverse agonists. J Med Chem 51:4780-9 (2008)  
Target
Name:
Histamine H3 receptor
Synonyms:
G-protein coupled receptor 97 HH3R HRH3 Histamine H3 receptor (H3) Histamine receptor (H3 and H4)
Type:
G Protein-Coupled Receptor (GPCR)
Mol. Mass.:
48691.47
Organism:
Homo sapiens (Human)
Description:
Binding assays were using CHO cells stably expressing hH3R receptors.
Residue:
445
  
Inhibitor
Name:
BDBM50263294
Synonyms:
3-(4-{[3-(1-Azepanyl)propyl]oxy}phenyl)-2-methyl-4(3H)-quinazolinone | CHEMBL476579
Type:
Small organic molecule
Emp. Form.:
C24H29N3O2
Mol. Mass.:
391.506
SMILES:
Cc1nc2ccccc2c(=O)n1-c1ccc(OCCCN2CCCCCC2)cc1
: