Target
Trace amine-associated receptor 1
Ligand
BDBM50241031
Substrate
Meas. Tech.
ChEMBL_489239 (CHEMBL989986)
EC50
65±n/a nM
Citation
 Lewin, AHNavarro, HAMascarella, SW Structure-activity correlations for beta-phenethylamines at human trace amine receptor 1. Bioorg Med Chem 16:7415-23 (2008)  
Target
Name:
Trace amine-associated receptor 1
Synonyms:
TA1 TAAR1_HUMAN TRAR1 | trace amine-associated receptor 1
Type:
PROTEIN
Mol. Mass.:
39107.47
Organism:
Homo sapiens (Human)
Description:
ChEMBL_792734
Residue:
339
  
Inhibitor
Name:
BDBM50241031
Synonyms:
2-(2-fluorophenyl)ethanamine CHEMBL379916
Type:
Small organic molecule
Emp. Form.:
C8H10FN
Mol. Mass.:
139.1701
SMILES:
NCCc1ccccc1F
: