Target
DNA ligase 1
Ligand
BDBM50262039
Substrate
Meas. Tech.
ChEMBL_514273 (CHEMBL979103)
IC50
4000±n/a nM
Citation
 Zhong, SChen, XZhu, XDziegielewska, BBachman, KEEllenberger, TBallin, JDWilson, GMTomkinson, AEMacKerell, AD Identification and validation of human DNA ligase inhibitors using computer-aided drug design. J Med Chem 51:4553-62 (2008)  
Target
Name:
DNA ligase 1
Synonyms:
ATP-dependent DNA ligase DNLI1_HUMAN LIG1 | Polydeoxyribonucleotide synthase [ATP]
Type:
Enzyme
Mol. Mass.:
101721.76
Organism:
Homo sapiens (Human)
Description:
Residue:
919
  
Inhibitor
Name:
BDBM50262039
Synonyms:
3-amino-2-(benzylideneamino)-5-mercaptophenol | CHEMBL468589
Type:
Small organic molecule
Emp. Form.:
C13H12N2OS
Mol. Mass.:
244.312
SMILES:
Nc1cc(S)cc(O)c1\N=C\c1ccccc1
: