Target
DNA ligase 1
Ligand
BDBM50262041
Substrate
Meas. Tech.
ChEMBL_514273 (CHEMBL979103)
IC50
600±n/a nM
Citation
 Zhong, SChen, XZhu, XDziegielewska, BBachman, KEEllenberger, TBallin, JDWilson, GMTomkinson, AEMacKerell, AD Identification and validation of human DNA ligase inhibitors using computer-aided drug design. J Med Chem 51:4553-62 (2008)  
Target
Name:
DNA ligase 1
Synonyms:
ATP-dependent DNA ligase DNLI1_HUMAN LIG1 | Polydeoxyribonucleotide synthase [ATP]
Type:
Enzyme
Mol. Mass.:
101721.76
Organism:
Homo sapiens (Human)
Description:
Residue:
919
  
Inhibitor
Name:
BDBM50262041
Synonyms:
5-(((5-carboxy-2-methylfuran-3-yl)methylthio)methyl)-2-methylfuran-3-carboxylic acid | CHEMBL468590
Type:
Small organic molecule
Emp. Form.:
C14H14O6S
Mol. Mass.:
310.322
SMILES:
Cc1oc(cc1CSCc1cc(C(O)=O)c(C)o1)C(O)=O
: