Target
Cytochrome P450 11B1, mitochondrial
Ligand
BDBM50272245
Substrate
Meas. Tech.
ChEMBL_510155 (CHEMBL1002228)
IC50
461±n/a nM
Citation
 Heim, RLucas, SGrombein, CMRies, CSchewe, KENegri, MMüller-Vieira, UBirk, BHartmann, RW Overcoming undesirable CYP1A2 inhibition of pyridylnaphthalene-type aldosterone synthase inhibitors: influence of heteroaryl derivatization on potency and selectivity. J Med Chem 51:5064-74 (2008)  
Target
Name:
Cytochrome P450 11B1, mitochondrial
Synonyms:
C11B1_HUMAN CYPXIB1 Cytochrome P450 11B1 Cytochrome P450 11B1, mitochondrial | S11BH
Type:
Enzyme
Mol. Mass.:
57591.44
Organism:
Homo sapiens (Human)
Description:
P15538
Residue:
503
  
Inhibitor
Name:
BDBM50272245
Synonyms:
6-(Pyridin-3-yl)-7,8-dihydronaphthalene-2-carbonitrile | CHEMBL500663
Type:
Small organic molecule
Emp. Form.:
C16H12N2
Mol. Mass.:
232.2799
SMILES:
N#Cc1ccc2C=C(CCc2c1)c1cccnc1
: