Target
Mu-type opioid receptor
Ligand
BDBM50272224
Substrate
Meas. Tech.
ChEMBL_510433 (CHEMBL1003109)
Ki
7.49±n/a nM
Citation
 Balboni, GFiorini, SBaldisserotto, ATrapella, CSasaki, YAmbo, AMarczak, EDLazarus, LHSalvadori, S Further studies on lead compounds containing the opioid pharmacophore Dmt-Tic. J Med Chem 51:5109-17 (2008)  
Target
Name:
Mu-type opioid receptor
Synonyms:
MOR-1 Mu-type opioid receptor (MOR) OPRM_RAT Opioid receptor B Ror-b
Type:
G Protein-Coupled Receptor (GPCR)
Mol. Mass.:
44503.11
Organism:
Rattus norvegicus (rat)
Description:
Competition binding assays were carried out using membrane preparations from transfected HN9.10 cells that constitutively expressed the mu opioid receptor.
Residue:
398
  
Inhibitor
Name:
BDBM50272224
Synonyms:
CHEMBL498799 | H-Dmt-Tic-D-Asp-NH-Ph
Type:
Small organic molecule
Emp. Form.:
C31H34N4O6
Mol. Mass.:
558.6249
SMILES:
Cc1cc(O)cc(C)c1C[C@H](N)C(=O)N1Cc2ccccc2C[C@H]1C(=O)N[C@H](CC(O)=O)C(=O)Nc1ccccc1
: