Target
Delta-type opioid receptor
Ligand
BDBM50266025
Substrate
Meas. Tech.
ChEMBL_510435 (CHEMBL1003111)
IC50
2.69±n/a nM
Citation
 Balboni, GFiorini, SBaldisserotto, ATrapella, CSasaki, YAmbo, AMarczak, EDLazarus, LHSalvadori, S Further studies on lead compounds containing the opioid pharmacophore Dmt-Tic. J Med Chem 51:5109-17 (2008)  
Target
Name:
Delta-type opioid receptor
Synonyms:
DOR-1 MSL-2 OPRD_MOUSE Oprd1
Type:
Enzyme Catalytic Domain
Mol. Mass.:
40577.25
Organism:
MOUSE
Description:
P32300
Residue:
372
  
Inhibitor
Name:
BDBM50266025
Synonyms:
(S)-2-((S)-2-amino-3-(4-hydroxy-2,6-dimethylphenyl)propanoyl)-N-(2-(benzylamino)-2-oxoethyl)-1,2,3,4-tetrahydroisoquinoline-3-carboxamide CHEMBL458631 H-Dmt-Tic-Gly-NH-CH2-Ph
Type:
Small organic molecule
Emp. Form.:
C30H34N4O4
Mol. Mass.:
514.6154
SMILES:
Cc1cc(O)cc(C)c1C[C@H](N)C(=O)N1Cc2ccccc2C[C@H]1C(=O)NCC(=O)NCc1ccccc1
: