Target
Vascular endothelial growth factor receptor 2
Ligand
BDBM50245294
Substrate
Meas. Tech.
ChEMBL_513139 (CHEMBL973628)
IC50
70±n/a nM
Citation
 Bauer, DWhittington, DACoxon, ABready, JHarriman, SPPatel, VFPolverino, AHarmange, JC Evaluation of indazole-based compounds as a new class of potent KDR/VEGFR-2 inhibitors. Bioorg Med Chem Lett 18:4844-8 (2008)  
Target
Name:
Vascular endothelial growth factor receptor 2
Synonyms:
CD_antigen=CD309 Fetal liver kinase 1 (FLK-1) KDR Protein-tyrosine kinase receptor Flk-1 VEGFR-2 VEGFR2 Vascular Endothelial Growth Factor Receptor Kinase 2 Vascular endothelial growth factor receptor 2 (KDR) Vascular endothelial growth factor receptor 2 (VEGFR2) Vascular endothelial growth factor receptor-2 (VEGFR-2)
Type:
Receptor Tyrosine Kinase
Mol. Mass.:
151510.97
Organism:
Homo sapiens (Human)
Description:
P35968
Residue:
1356
  
Inhibitor
Name:
BDBM50245294
Synonyms:
6-(6,7-dimethoxyquinolin-4-yloxy)-1-methyl-N-(4-(trifluoromethyl)phenyl)-1H-indazol-3-amine | CHEMBL516639
Type:
Small organic molecule
Emp. Form.:
C26H21F3N4O3
Mol. Mass.:
494.4651
SMILES:
COc1cc2nccc(Oc3ccc4c(Nc5ccc(cc5)C(F)(F)F)nn(C)c4c3)c2cc1OC
: