Target
Macrophage colony-stimulating factor 1 receptor
Ligand
BDBM50244845
Substrate
Meas. Tech.
ChEMBL_512118 (CHEMBL980054)
IC50
6±n/a nM
Citation
 Scott, DAAquila, BMBebernitz, GACook, DJDakin, LADeegan, TLHattersley, MMIoannidis, SLyne, PDOmer, CAYe, MZheng, X Pyridyl and thiazolyl bisamide CSF-1R inhibitors for the treatment of cancer. Bioorg Med Chem Lett 18:4794-7 (2008)  
Target
Name:
Macrophage colony-stimulating factor 1 receptor
Synonyms:
CSF1R FMS Macrophage colony stimulating factor receptor Macrophage colony-stimulating factor 1 receptor (c-FMS) Proto-oncogene c-Fms c-fms | cFMS
Type:
Protein
Mol. Mass.:
107979.48
Organism:
Homo sapiens (Human)
Description:
P07333
Residue:
972
  
Inhibitor
Name:
BDBM50244845
Synonyms:
2-chloro-5-[(3,5-dimethylbenzoyl)amino]-N-(2-methyl-1,3-thiazol-5-yl)benzamide | CHEMBL462128
Type:
Small organic molecule
Emp. Form.:
C20H18ClN3O2S
Mol. Mass.:
399.894
SMILES:
Cc1ncc(NC(=O)c2cc(NC(=O)c3cc(C)cc(C)c3)ccc2Cl)s1
: