Target
Glucose-dependent insulinotropic receptor
Ligand
BDBM50244398
Substrate
Meas. Tech.
ChEMBL_512175 (CHEMBL968034)
IC50
50±n/a nM
Citation
 Semple, GFioravanti, BPereira, GCalderon, IUy, JChoi, KXiong, YRen, AMorgan, MDave, VThomsen, WUnett, DJXing, CBossie, SCarroll, CChu, ZLGrottick, AJHauser, EKLeonard, JJones, RM Discovery of the first potent and orally efficacious agonist of the orphan G-protein coupled receptor 119. J Med Chem 51:5172-5 (2008)  
Target
Name:
Glucose-dependent insulinotropic receptor
Synonyms:
G-protein coupled receptor 119 (GPR119) GPR119 | Glucose-dependent insulinotropic receptor
Type:
Protein
Mol. Mass.:
36901.49
Organism:
Homo sapiens (Human)
Description:
Q8TDV5
Residue:
335
  
Inhibitor
Name:
BDBM50244398
Synonyms:
1-[6-(4-bromo-phenoxy)-5-nitro-pyrimidin-4-yl]-piperidine-4-carboxylic acid ethyl ester | CHEMBL487639
Type:
Small organic molecule
Emp. Form.:
C18H19BrN4O5
Mol. Mass.:
451.271
SMILES:
CCOC(=O)C1CCN(CC1)c1ncnc(Oc2ccc(Br)cc2)c1[N+]([O-])=O
: