Target
Sodium- and chloride-dependent glycine transporter 2
Ligand
BDBM50264771
Substrate
Meas. Tech.
ChEMBL_496466 (CHEMBL1007113)
EC50
>30000±n/a nM
Citation
 Pinard, EAlberati, DBorroni, EFischer, HHainzl, DJolidon, SMoreau, JLNarquizian, RNettekoven, MNorcross, RDStalder, HThomas, AW Discovery of benzoylpiperazines as a novel class of potent and selective GlyT1 inhibitors. Bioorg Med Chem Lett 18:5134-9 (2008)  
Target
Name:
Sodium- and chloride-dependent glycine transporter 2
Synonyms:
GLYT2 NET1 SLC6A5 | Sodium- and chloride-dependent glycine transporter 2
Type:
Enzyme Catalytic Domain
Mol. Mass.:
87438.56
Organism:
Homo sapiens (Human)
Description:
Glycine-2-transporter 0 HUMAN::Q9Y345
Residue:
797
  
Inhibitor
Name:
BDBM50264771
Synonyms:
(2-morpholino-5-nitrophenyl)(4-(2-(trifluoromethyl)phenyl)piperazin-1-yl)methanone | CHEMBL524128
Type:
Small organic molecule
Emp. Form.:
C22H23F3N4O4
Mol. Mass.:
464.4376
SMILES:
[O-][N+](=O)c1ccc(N2CCOCC2)c(c1)C(=O)N1CCN(CC1)c1ccccc1C(F)(F)F
: