Target
Sodium- and chloride-dependent glycine transporter 1
Ligand
BDBM50264899
Substrate
Meas. Tech.
ChEMBL_496465 (CHEMBL1007112)
EC50
2900±n/a nM
Citation
 Pinard, EAlberati, DBorroni, EFischer, HHainzl, DJolidon, SMoreau, JLNarquizian, RNettekoven, MNorcross, RDStalder, HThomas, AW Discovery of benzoylpiperazines as a novel class of potent and selective GlyT1 inhibitors. Bioorg Med Chem Lett 18:5134-9 (2008)  
Target
Name:
Sodium- and chloride-dependent glycine transporter 1
Synonyms:
GlyT-1 Glycine Transporters (GlyT1c) SC6A9_HUMAN Sodium- and chloride-dependent glycine transporter 1 Sodium- and chloride-dependent glycine transporter 1 (GlyT1c) Solute carrier family 6 member 9
Type:
Enzyme
Mol. Mass.:
78270.54
Organism:
Homo sapiens (Human)
Description:
P48067
Residue:
706
  
Inhibitor
Name:
BDBM50264899
Synonyms:
(2-morpholino-5-nitrophenyl)(4-p-tolylpiperazin-1-yl)methanone | CHEMBL497973
Type:
Small organic molecule
Emp. Form.:
C22H26N4O4
Mol. Mass.:
410.4662
SMILES:
Cc1ccc(cc1)N1CCN(CC1)C(=O)c1cc(ccc1N1CCOCC1)[N+]([O-])=O
: