Target
Sodium- and chloride-dependent glycine transporter 1
Ligand
BDBM50264771
Substrate
Meas. Tech.
ChEMBL_496465 (CHEMBL1007112)
EC50
7100±n/a nM
Citation
 Pinard, EAlberati, DBorroni, EFischer, HHainzl, DJolidon, SMoreau, JLNarquizian, RNettekoven, MNorcross, RDStalder, HThomas, AW Discovery of benzoylpiperazines as a novel class of potent and selective GlyT1 inhibitors. Bioorg Med Chem Lett 18:5134-9 (2008)  
Target
Name:
Sodium- and chloride-dependent glycine transporter 1
Synonyms:
GlyT-1 Glycine Transporters (GlyT1c) SC6A9_HUMAN Sodium- and chloride-dependent glycine transporter 1 Sodium- and chloride-dependent glycine transporter 1 (GlyT1c) Solute carrier family 6 member 9
Type:
Enzyme
Mol. Mass.:
78270.54
Organism:
Homo sapiens (Human)
Description:
P48067
Residue:
706
  
Inhibitor
Name:
BDBM50264771
Synonyms:
(2-morpholino-5-nitrophenyl)(4-(2-(trifluoromethyl)phenyl)piperazin-1-yl)methanone | CHEMBL524128
Type:
Small organic molecule
Emp. Form.:
C22H23F3N4O4
Mol. Mass.:
464.4376
SMILES:
[O-][N+](=O)c1ccc(N2CCOCC2)c(c1)C(=O)N1CCN(CC1)c1ccccc1C(F)(F)F
: