Target
Hydroxycarboxylic acid receptor 2
Ligand
BDBM50264188
Substrate
Meas. Tech.
ChEMBL_535373 (CHEMBL983499)
EC50
1200±n/a nM
Citation
 Deng, QFrie, JLMarley, DMBeresis, RTRen, NCai, TQTaggart, AKCheng, KCarballo-Jane, EWang, JTong, XWaters, MGTata, JRColletti, SL Molecular modeling aided design of nicotinic acid receptor GPR109A agonists. Bioorg Med Chem Lett 18:4963-7 (2008)  
Target
Name:
Hydroxycarboxylic acid receptor 2
Synonyms:
G-protein coupled receptor 109A GPR109A HCAR2 HM74A NIACR1 Nicotinic acid receptor 1
Type:
G Protein-Coupled Receptor (GPCR)
Mol. Mass.:
41868.22
Organism:
Homo sapiens (Human)
Description:
Membranes from CHO cells expressing the recombinant human GPR109A were used in competition binding assay.
Residue:
363
  
Inhibitor
Name:
BDBM50264188
Synonyms:
2-(2-(4-tert-butylphenoxy)acetamido)benzoic acid | CHEMBL443733
Type:
Small organic molecule
Emp. Form.:
C19H21NO4
Mol. Mass.:
327.3743
SMILES:
CC(C)(C)c1ccc(OCC(=O)Nc2ccccc2C(O)=O)cc1
: