Target
Hydroxycarboxylic acid receptor 2
Ligand
BDBM50264232
Substrate
Meas. Tech.
ChEMBL_535370 (CHEMBL983496)
IC50
24±n/a nM
Citation
 Deng, QFrie, JLMarley, DMBeresis, RTRen, NCai, TQTaggart, AKCheng, KCarballo-Jane, EWang, JTong, XWaters, MGTata, JRColletti, SL Molecular modeling aided design of nicotinic acid receptor GPR109A agonists. Bioorg Med Chem Lett 18:4963-7 (2008)  
Target
Name:
Hydroxycarboxylic acid receptor 2
Synonyms:
G-protein coupled receptor 109A GPR109A HCAR2 HM74A NIACR1 Nicotinic acid receptor 1
Type:
G Protein-Coupled Receptor (GPCR)
Mol. Mass.:
41868.22
Organism:
Homo sapiens (Human)
Description:
Membranes from CHO cells expressing the recombinant human GPR109A were used in competition binding assay.
Residue:
363
  
Inhibitor
Name:
BDBM50264232
Synonyms:
2-(3-(6-hydroxynaphthalen-2-yl)propanamido)benzoic acid | CHEMBL522649
Type:
Small organic molecule
Emp. Form.:
C20H17NO4
Mol. Mass.:
335.3533
SMILES:
OC(=O)c1ccccc1NC(=O)CCc1ccc2cc(O)ccc2c1
: