Target
Hydroxycarboxylic acid receptor 2
Ligand
BDBM50264234
Substrate
Meas. Tech.
ChEMBL_535373 (CHEMBL983499)
EC50
940±n/a nM
Citation
 Deng, QFrie, JLMarley, DMBeresis, RTRen, NCai, TQTaggart, AKCheng, KCarballo-Jane, EWang, JTong, XWaters, MGTata, JRColletti, SL Molecular modeling aided design of nicotinic acid receptor GPR109A agonists. Bioorg Med Chem Lett 18:4963-7 (2008)  
Target
Name:
Hydroxycarboxylic acid receptor 2
Synonyms:
G-protein coupled receptor 109A GPR109A HCAR2 HM74A NIACR1 Nicotinic acid receptor 1
Type:
G Protein-Coupled Receptor (GPCR)
Mol. Mass.:
41868.22
Organism:
Homo sapiens (Human)
Description:
Membranes from CHO cells expressing the recombinant human GPR109A were used in competition binding assay.
Residue:
363
  
Inhibitor
Name:
BDBM50264234
Synonyms:
2-(3-(6-formylnaphthalen-2-yl)propanamido)benzoic acid | CHEMBL491003
Type:
Small organic molecule
Emp. Form.:
C21H17NO4
Mol. Mass.:
347.364
SMILES:
OC(=O)c1ccccc1NC(=O)CCc1ccc2cc(C=O)ccc2c1
: