Target
Melatonin receptor type 1A
Ligand
BDBM50035179
Substrate
Meas. Tech.
ChEMBL_535635 (CHEMBL987963)
Ki
0.06±n/a nM
Citation
 Poissonnier-Durieux, SEttaoussi, MPérès, BBoutin, JAAudinot, VBennejean, CDelagrange, PCaignard, DHRenard, PBerthelot, PLesieur, DYous, S Synthesis of 3-phenylnaphthalenic derivatives as new selective MT(2) melatoninergic ligands. Bioorg Med Chem 16:8339-48 (2008)  
Target
Name:
Melatonin receptor type 1A
Synonyms:
MTNR1A MTR1A_HUMAN Mel1a melatonin receptor Melatonin receptor Melatonin receptor type 1 (MT1) | Melatonin receptor type 1A
Type:
Enzyme
Mol. Mass.:
39392.94
Organism:
Homo sapiens (Human)
Description:
P48039
Residue:
350
  
Inhibitor
Name:
BDBM50035179
Synonyms:
Agomelatine N-[2-(7-Methoxy-naphthalen-1-yl)-ethyl]-acetamide S 20098 US11091445, Compound code IA2-76
Type:
Small organic molecule
Emp. Form.:
C15H17NO2
Mol. Mass.:
243.301
SMILES:
COc1ccc2cccc(CCNC(C)=O)c2c1
: