Target
Sodium-dependent dopamine transporter
Ligand
BDBM50110788
Substrate
Meas. Tech.
ChEMBL_492711 (CHEMBL938511)
Ki
>1000±n/a nM
Citation
 Mavel, SVercouillie, JGarreau, LRaguza, TRavna, AWChalon, SGuilloteau, DEmond, P Docking study, synthesis, and in vitro evaluation of fluoro-MADAM derivatives as SERT ligands for PET imaging. Bioorg Med Chem 16:9050-5 (2008)  
Target
Name:
Sodium-dependent dopamine transporter
Synonyms:
DA transporter DAT1 Dopamine transporter protein (DAT) SC6A3_HUMAN Sodium-dependent dopamine transporter Solute carrier family 6 member 3
Type:
Multi-pass membrane protein
Mol. Mass.:
68497.11
Organism:
Homo sapiens (Human)
Description:
Q01959
Residue:
620
  
Inhibitor
Name:
BDBM50110788
Synonyms:
2-(2-((dimethylamino)methyl)phenylthio)-5-methylaniline 2-(2-Dimethylaminomethyl-phenylsulfanyl)-5-methyl-phenylamine MADAM | N,N-dimethyl-2-(2-amino-4-methylphenylthio)benzylamine
Type:
Small organic molecule
Emp. Form.:
C16H20N2S
Mol. Mass.:
272.408
SMILES:
CN(C)Cc1ccccc1Sc1ccc(C)cc1N
: