Target
Sodium-dependent noradrenaline transporter
Ligand
BDBM50265292
Substrate
Meas. Tech.
ChEMBL_492712 (CHEMBL938512)
Ki
>1000±n/a nM
Citation
 Mavel, SVercouillie, JGarreau, LRaguza, TRavna, AWChalon, SGuilloteau, DEmond, P Docking study, synthesis, and in vitro evaluation of fluoro-MADAM derivatives as SERT ligands for PET imaging. Bioorg Med Chem 16:9050-5 (2008)  
Target
Name:
Sodium-dependent noradrenaline transporter
Synonyms:
Monoamine transporter NET Noradrenaline Transporter (NET) Norepinephrine transporter protein (NET) SLC6A2 Sodium-dependent noradrenaline transporter (NET) | Solute carrier family 6 member 2
Type:
Multi-pass membrane protein
Mol. Mass.:
69337.72
Organism:
Homo sapiens (Human)
Description:
P23975
Residue:
617
  
Inhibitor
Name:
BDBM50265292
Synonyms:
CHEMBL498367 | N,N-Dimethyl-2-[2-(N-4-nitrobenzamide)-4-tolylthio]benzylamine
Type:
Small organic molecule
Emp. Form.:
C23H23N3O3S
Mol. Mass.:
421.512
SMILES:
CN(C)Cc1ccccc1Sc1ccc(C)cc1NC(=O)c1ccc(cc1)[N+]([O-])=O
: