Target
Sodium-dependent serotonin transporter
Ligand
BDBM50264820
Substrate
Meas. Tech.
ChEMBL_492707 (CHEMBL938507)
Ki
>500±n/a nM
Citation
 Mavel, SVercouillie, JGarreau, LRaguza, TRavna, AWChalon, SGuilloteau, DEmond, P Docking study, synthesis, and in vitro evaluation of fluoro-MADAM derivatives as SERT ligands for PET imaging. Bioorg Med Chem 16:9050-5 (2008)  
Target
Name:
Sodium-dependent serotonin transporter
Synonyms:
5-HT Transporter 5HT transporter Anandamid membrane transporter, AMT Monoamine transporters; Norepinephrine & serotonin Slc6a4 Sodium-dependent serotonin transporter (SERT) | imipramine receptor
Type:
Multi-pass membrane protein
Mol. Mass.:
70168.43
Organism:
Rattus norvegicus (rat)
Description:
P31652
Residue:
630
  
Inhibitor
Name:
BDBM50264820
Synonyms:
CHEMBL451264 | N-Methyl-2-[2-(N-4-fluorobenzamide)-4-tolylthio]benzylamine
Type:
Small organic molecule
Emp. Form.:
C22H21FN2OS
Mol. Mass.:
380.478
SMILES:
CNCc1ccccc1Sc1ccc(C)cc1NC(=O)c1ccc(F)cc1
: