Target
5-hydroxytryptamine receptor 1A
Ligand
BDBM50252693
Substrate
Meas. Tech.
ChEMBL_539775 (CHEMBL1034993)
Ki
29±n/a nM
Citation
 Leopoldo, MLacivita, EDe Giorgio, PFracasso, CGuzzetti, SCaccia, SContino, MColabufo, NABerardi, FPerrone, R Structural modifications of N-(1,2,3,4-tetrahydronaphthalen-1-yl)-4-aryl-1-piperazinehexanamides: influence on lipophilicity and 5-HT7 receptor activity. Part III. J Med Chem 51:5813-22 (2008)  
Target
Name:
5-hydroxytryptamine receptor 1A
Synonyms:
5-HT-1A 5-hydroxytryptamine receptor 1A (5-HT-1A) ADRB2RL1 Dopamine D2 receptor and serotonin 1a receptor HTR1A | Serotonin receptor 1A
Type:
Mol. Mass.:
46122.49
Organism:
Homo sapiens (Human)
Description:
Residue:
422
  
Inhibitor
Name:
BDBM50252693
Synonyms:
CHEMBL522194 | N-(4-Methanesulfonyloxyphenylmethyl)-4-(2-methoxyphenyl)-1-piperazinehexanamide
Type:
Small organic molecule
Emp. Form.:
C25H35N3O5S
Mol. Mass.:
489.628
SMILES:
COc1ccccc1N1CCN(CCCCCC(=O)NCc2ccc(OS(C)(=O)=O)cc2)CC1
: