Target
5-hydroxytryptamine receptor 7
Ligand
BDBM50252691
Substrate
Meas. Tech.
ChEMBL_539774 (CHEMBL1034992)
Ki
5.7±n/a nM
Citation
 Leopoldo, MLacivita, EDe Giorgio, PFracasso, CGuzzetti, SCaccia, SContino, MColabufo, NABerardi, FPerrone, R Structural modifications of N-(1,2,3,4-tetrahydronaphthalen-1-yl)-4-aryl-1-piperazinehexanamides: influence on lipophilicity and 5-HT7 receptor activity. Part III. J Med Chem 51:5813-22 (2008)  
Target
Name:
5-hydroxytryptamine receptor 7
Synonyms:
5-HT-7 5-HT7 5-HT7S 5-hydroxytryptamine receptor 7 5HT7R_RAT GPRFO Serotonin (5-HT) receptor | Serotonin Receptor 7
Type:
G Protein-Coupled Receptor (GPCR)
Mol. Mass.:
49852.62
Organism:
Rattus norvegicus (rat)
Description:
Rat cloned 5-HT7R.
Residue:
448
  
Inhibitor
Name:
BDBM50252691
Synonyms:
CHEMBL494458 | N-(4-Methanesulfonyloxyphenylmethyl)-4-(2-diphenyl)-1-piperazinehexanamide
Type:
Small organic molecule
Emp. Form.:
C30H37N3O4S
Mol. Mass.:
535.697
SMILES:
CS(=O)(=O)Oc1ccc(CNC(=O)CCCCCN2CCN(CC2)c2ccccc2-c2ccccc2)cc1
: