Target
Cytochrome P450 2C9
Ligand
BDBM50263404
Substrate
Meas. Tech.
ChEMBL_536101 (CHEMBL995047)
IC50
>50000±n/a nM
Citation
 Jolidon, SAlberati, DDowle, AFischer, HHainzl, DNarquizian, RNorcross, RPinard, E Design, synthesis and structure-activity relationship of simple bis-amides as potent inhibitors of GlyT1. Bioorg Med Chem Lett 18:5533-6 (2008)  
Target
Name:
Cytochrome P450 2C9
Synonyms:
(R)-limonene 6-monooxygenase CP2C9_HUMAN CYP2C9 Cytochrome P450 2C9 (CYP2C9 ) P-450MP P450 PB-1 | S-mephenytoin 4-hydroxylase
Type:
Enzyme
Mol. Mass.:
55636.33
Organism:
Homo sapiens (Human)
Description:
P11712
Residue:
490
  
Inhibitor
Name:
BDBM50263404
Synonyms:
4-fluoro-N-(2-oxo-2-(phenyl(pyrimidin-2-yl)methylamino)ethyl)benzamide | CHEMBL514241
Type:
Small organic molecule
Emp. Form.:
C20H17FN4O2
Mol. Mass.:
364.373
SMILES:
Fc1ccc(cc1)C(=O)NCC(=O)NC(c1ccccc1)c1ncccn1
: