Target
Cholinesterase
Ligand
BDBM10625
Substrate
Meas. Tech.
ChEMBL_534768 (CHEMBL986292)
IC50
733±n/a nM
Citation
 Carolan, CGDillon, GPGaynor, JMReidy, SRyder, SAKhan, DMarquez, JFGilmer, JF Isosorbide-2-carbamate esters: potent and selective butyrylcholinesterase inhibitors. J Med Chem 51:6400-9 (2008)  
Target
Name:
Cholinesterase
Synonyms:
Acylcholine acylhydrolase Butyrylcholine esterase (BChE) Butyrylcholinesterase (BuChE) CHLE_HUMAN Cholinesterases Pseudocholinesterase
Type:
Homotetramer
Mol. Mass.:
68422.27
Organism:
Homo sapiens (Human)
Description:
P06276
Residue:
602
  
Inhibitor
Name:
BDBM10625
Synonyms:
({[bis(propan-2-ylamino)phosphoryl]oxy}(propan-2-ylamino)phosphoryl)(propan-2-yl)amine iso-OMPA | tetra(monoisopropyl)pyrophosphortetramide
Type:
Small organic molecule
Emp. Form.:
C12H32N4O3P2
Mol. Mass.:
342.355
SMILES:
CC(C)NP(=O)(NC(C)C)OP(=O)(NC(C)C)NC(C)C
: