Target
Muscarinic acetylcholine receptor M5
Ligand
BDBM50275503
Substrate
Meas. Tech.
ChEMBL_492762 (CHEMBL939450)
EC50
>30000±n/a nM
Citation
 Miller, NRDaniels, RNBridges, TMBrady, AEConn, PJLindsley, CW Synthesis and SAR of analogs of the M1 allosteric agonist TBPB. Part II: Amides, sulfonamides and ureas--the effect of capping the distal basic piperidine nitrogen. Bioorg Med Chem Lett 18:5443-7 (2008)  
Target
Name:
Muscarinic acetylcholine receptor M5
Synonyms:
ACM5_HUMAN | CHRM5
Type:
PROTEIN
Mol. Mass.:
60102.35
Organism:
Homo sapiens (Human)
Description:
ChEMBL_1517990
Residue:
532
  
Inhibitor
Name:
BDBM50275503
Synonyms:
5-fluoro-1-(1'-(phenylsulfonyl)-1,4'-bipiperidin-4-yl)-1H-benzo[d]imidazol-2(3H)-one | CHEMBL485755
Type:
Small organic molecule
Emp. Form.:
C23H27FN4O3S
Mol. Mass.:
458.549
SMILES:
Fc1ccc2n(C3CCN(CC3)C3CCN(CC3)S(=O)(=O)c3ccccc3)c(=O)[nH]c2c1
: