Target
Muscarinic acetylcholine receptor M3
Ligand
BDBM50275503
Substrate
Meas. Tech.
ChEMBL_492758 (CHEMBL939446)
EC50
>30000±n/a nM
Citation
 Miller, NRDaniels, RNBridges, TMBrady, AEConn, PJLindsley, CW Synthesis and SAR of analogs of the M1 allosteric agonist TBPB. Part II: Amides, sulfonamides and ureas--the effect of capping the distal basic piperidine nitrogen. Bioorg Med Chem Lett 18:5443-7 (2008)  
Target
Name:
Muscarinic acetylcholine receptor M3
Synonyms:
ACM3_HUMAN Cholinergic, muscarinic M3 Muscarinic receptor M3 | RecName: Full=Muscarinic acetylcholine receptor M3
Type:
Enzyme
Mol. Mass.:
66151.03
Organism:
Homo sapiens (Human)
Description:
P20309
Residue:
590
  
Inhibitor
Name:
BDBM50275503
Synonyms:
5-fluoro-1-(1'-(phenylsulfonyl)-1,4'-bipiperidin-4-yl)-1H-benzo[d]imidazol-2(3H)-one | CHEMBL485755
Type:
Small organic molecule
Emp. Form.:
C23H27FN4O3S
Mol. Mass.:
458.549
SMILES:
Fc1ccc2n(C3CCN(CC3)C3CCN(CC3)S(=O)(=O)c3ccccc3)c(=O)[nH]c2c1
: