Target
Muscarinic acetylcholine receptor M4
Ligand
BDBM50275503
Substrate
Meas. Tech.
ChEMBL_492760 (CHEMBL939448)
EC50
>30000±n/a nM
Citation
 Miller, NRDaniels, RNBridges, TMBrady, AEConn, PJLindsley, CW Synthesis and SAR of analogs of the M1 allosteric agonist TBPB. Part II: Amides, sulfonamides and ureas--the effect of capping the distal basic piperidine nitrogen. Bioorg Med Chem Lett 18:5443-7 (2008)  
Target
Name:
Muscarinic acetylcholine receptor M4
Synonyms:
ACM4_HUMAN Cholinergic, muscarinic M4 Muscarinic acetylcholine receptor M2 and M4
Type:
Enzyme Catalytic Domain
Mol. Mass.:
53079.31
Organism:
Homo sapiens (Human)
Description:
Cholinergic, muscarinic M4 CHRM4 HUMAN M3::P08173
Residue:
479
  
Inhibitor
Name:
BDBM50275503
Synonyms:
5-fluoro-1-(1'-(phenylsulfonyl)-1,4'-bipiperidin-4-yl)-1H-benzo[d]imidazol-2(3H)-one | CHEMBL485755
Type:
Small organic molecule
Emp. Form.:
C23H27FN4O3S
Mol. Mass.:
458.549
SMILES:
Fc1ccc2n(C3CCN(CC3)C3CCN(CC3)S(=O)(=O)c3ccccc3)c(=O)[nH]c2c1
: