Target
Adenosine receptor A2a
Ligand
BDBM50275744
Substrate
Meas. Tech.
ChEMBL_492788 (CHEMBL939476)
Ki
19±n/a nM
Citation
 Moorjani, MLuo, ZLin, EVong, BGChen, YZhang, XRueter, JKGross, RSLanier, MCTellew, JEWilliams, JPLechner, SMMalany, SSantos, MCrespo, MIDíaz, JLSaunders, JSlee, DH 2,6-Diaryl-4-acylaminopyrimidines as potent and selective adenosine A(2A) antagonists with improved solubility and metabolic stability. Bioorg Med Chem Lett 18:5402-5 (2008)  
Target
Name:
Adenosine receptor A2a
Synonyms:
A2A adenosine receptor (hA2A) ADENOSINE A2 ADORA2 Adenosine A2A receptor (A2AAR)
Type:
G Protein-Coupled Receptor (GPCR)
Mol. Mass.:
44716.46
Organism:
Homo sapiens (Human)
Description:
P29274
Residue:
412
  
Inhibitor
Name:
BDBM50275744
Synonyms:
CHEMBL519554 | N-(2-(3,5-dimethyl-1H-pyrazol-1-yl)-6-(2,5-dimethylphenyl)pyrimidin-4-yl)acetamide
Type:
Small organic molecule
Emp. Form.:
C19H21N5O
Mol. Mass.:
335.4029
SMILES:
CC(=O)Nc1cc(nc(n1)-n1nc(C)cc1C)-c1cc(C)ccc1C
: