Target
Histamine H2 receptor
Ligand
BDBM50274692
Substrate
Meas. Tech.
ChEMBL_537283 (CHEMBL985379)
IC50
>10000±n/a nM
Citation
 Nagase, TMizutani, TSekino, EIshikawa, SIto, SMitobe, YMiyamoto, YYoshimoto, RTanaka, TIshihara, ATakenaga, NTokita, SSato, N Synthesis and evaluation of structurally constrained quinazolinone derivatives as potent and selective histamine H3 receptor inverse agonists. J Med Chem 51:6889-901 (2008)  
Target
Name:
Histamine H2 receptor
Synonyms:
Gastric receptor I HISTAMINE H2 HRH2_HUMAN Histamine H2-Gs alpha S
Type:
G Protein-Coupled Receptor (GPCR)
Mol. Mass.:
40115.31
Organism:
Homo sapiens (Human)
Description:
Residue:
359
  
Inhibitor
Name:
BDBM50274692
Synonyms:
3-(4-[(1-Cyclobutyl-4-piperidinyl)oxy]phenyl)-5-fluoro-2-methyl-4(3H)-quinazolinone | CHEMBL483400
Type:
Small organic molecule
Emp. Form.:
C24H26FN3O2
Mol. Mass.:
407.4805
SMILES:
Cc1nc2cccc(F)c2c(=O)n1-c1ccc(OC2CCN(CC2)C2CCC2)cc1
: