Target
Histamine H3 receptor
Ligand
BDBM50274037
Substrate
Meas. Tech.
ChEMBL_537241 (CHEMBL981856)
IC50
1.2±n/a nM
Citation
 Nagase, TMizutani, TSekino, EIshikawa, SIto, SMitobe, YMiyamoto, YYoshimoto, RTanaka, TIshihara, ATakenaga, NTokita, SSato, N Synthesis and evaluation of structurally constrained quinazolinone derivatives as potent and selective histamine H3 receptor inverse agonists. J Med Chem 51:6889-901 (2008)  
Target
Name:
Histamine H3 receptor
Synonyms:
G-protein coupled receptor 97 HH3R HRH3 Histamine H3 receptor (H3) Histamine receptor (H3 and H4)
Type:
G Protein-Coupled Receptor (GPCR)
Mol. Mass.:
48691.47
Organism:
Homo sapiens (Human)
Description:
Binding assays were using CHO cells stably expressing hH3R receptors.
Residue:
445
  
Inhibitor
Name:
BDBM50274037
Synonyms:
3-(4-[(1-Cyclobutyl-4-piperidinyl)oxy]phenyl)-5-methoxy-2-methyl-4(3H)-quinazolinone | CHEMBL520629
Type:
Small organic molecule
Emp. Form.:
C25H29N3O3
Mol. Mass.:
419.5161
SMILES:
COc1cccc2nc(C)n(-c3ccc(OC4CCN(CC4)C4CCC4)cc3)c(=O)c12
: