Target
Potassium voltage-gated channel subfamily H member 2
Ligand
BDBM50274037
Substrate
Meas. Tech.
ChEMBL_537242 (CHEMBL981857)
IC50
>10000±n/a nM
Citation
 Nagase, TMizutani, TSekino, EIshikawa, SIto, SMitobe, YMiyamoto, YYoshimoto, RTanaka, TIshihara, ATakenaga, NTokita, SSato, N Synthesis and evaluation of structurally constrained quinazolinone derivatives as potent and selective histamine H3 receptor inverse agonists. J Med Chem 51:6889-901 (2008)  
Target
Name:
Potassium voltage-gated channel subfamily H member 2
Synonyms:
1,3-beta-glucan synthase component GLS2 ERG Eag-related protein 1 Ether-a-go-go-related gene (HERG) Ether-a-go-go-related gene potassium channel 1 Ether-a-go-go-related gene potassium channel 1 (hERG1) Ether-a-go-go-related protein 1 H-ERG KCNH2 Potassium voltage-gated channel subfamily H member 2 (hERG) Voltage-gated potassium channel subunit Kv11.1 hERG Potassium Channel 1 | putative potassium channel subunit
Type:
Multi-pass membrane protein
Mol. Mass.:
126672.65
Organism:
Homo sapiens (Human)
Description:
Q12809
Residue:
1159
  
Inhibitor
Name:
BDBM50274037
Synonyms:
3-(4-[(1-Cyclobutyl-4-piperidinyl)oxy]phenyl)-5-methoxy-2-methyl-4(3H)-quinazolinone | CHEMBL520629
Type:
Small organic molecule
Emp. Form.:
C25H29N3O3
Mol. Mass.:
419.5161
SMILES:
COc1cccc2nc(C)n(-c3ccc(OC4CCN(CC4)C4CCC4)cc3)c(=O)c12
: