Target
Cyclin-dependent kinase 9
Ligand
BDBM5929
Substrate
Meas. Tech.
ChEMBL_557991 (CHEMBL965586)
IC50
550±n/a nM
Citation
 Fan, JFahr, BStockett, DChan, ECheeti, SSerafimova, ILu, YPham, PWalker, DHHoch, UChoong, IC Modifications of the isonipecotic acid fragment of SNS-032: analogs with improved permeability and lower efflux ratio. Bioorg Med Chem Lett 18:6236-9 (2008)  
Target
Name:
Cyclin-dependent kinase 9
Synonyms:
C-2K CDK9 Cell division cycle 2-like protein kinase 4 Cyclin-Dependent Kinase 9 (CDK9) Serine/threonine-protein kinase PITALRE Tat-associated kinase complex catalytic subunit
Type:
Enzyme Subunit
Mol. Mass.:
42789.13
Organism:
Homo sapiens (Human)
Description:
Residue:
372
  
Inhibitor
Name:
BDBM5929
Synonyms:
(+/-)-N-[5-[[[5-(1,1-Dimethylethyl)-2-oxazolyl]methyl]thio]-2-thiazolyl]-3-piperidinecarboxamide CHEMBL297570 | N-(5-{[(5-tert-butyl-1,3-oxazol-2-yl)methyl]sulfanyl}-1,3-thiazol-2-yl)piperidine-3-carboxamide
Type:
Small organic molecule
Emp. Form.:
C17H24N4O2S2
Mol. Mass.:
380.528
SMILES:
CC(C)(C)c1cnc(CSc2cnc(NC(=O)C3CCCNC3)s2)o1
: