Target
Tyrosine-protein kinase ZAP-70
Ligand
BDBM50276015
Substrate
Meas. Tech.
ChEMBL_492925 (CHEMBL945313)
Ki
419.1±n/a nM
Citation
 Farmer, LJBemis, GBritt, SDCochran, JConnors, MHarrington, EMHoock, TMarkland, WNanthakumar, STaslimi, PTer Haar, EWang, JZhaveri, DSalituro, FG Discovery and SAR of novel 4-thiazolyl-2-phenylaminopyrimidines as potent inhibitors of spleen tyrosine kinase (SYK). Bioorg Med Chem Lett 18:6231-5 (2008)  
Target
Name:
Tyrosine-protein kinase ZAP-70
Synonyms:
70 kDa zeta-associated protein Syk-related tyrosine kinase Tyrosine-protein kinase ZAP-70 Tyrosine-protein kinase ZAP-70 (ZAP70) ZAP70 Zeta-chain (TCR) associated protein kinase 70kDa
Type:
Enzyme
Mol. Mass.:
69881.61
Organism:
Homo sapiens (Human)
Description:
ZAP-70 SH2 domain was expressed and purified from E. coli using O-phospho-L-tyrosine-agarose column.
Residue:
619
  
Inhibitor
Name:
BDBM50276015
Synonyms:
CHEMBL509161 | N-(3,5-dimethylphenyl)-4-(thiazol-2-yl)pyrimidin-2-amine
Type:
Small organic molecule
Emp. Form.:
C15H14N4S
Mol. Mass.:
282.363
SMILES:
Cc1cc(C)cc(Nc2nccc(n2)-c2nccs2)c1
: