Target
Proto-oncogene tyrosine-protein kinase Src
Ligand
BDBM50249356
Substrate
Meas. Tech.
ChEMBL_492924 (CHEMBL945312)
Ki
2030.0±n/a nM
Citation
 Farmer, LJBemis, GBritt, SDCochran, JConnors, MHarrington, EMHoock, TMarkland, WNanthakumar, STaslimi, PTer Haar, EWang, JZhaveri, DSalituro, FG Discovery and SAR of novel 4-thiazolyl-2-phenylaminopyrimidines as potent inhibitors of spleen tyrosine kinase (SYK). Bioorg Med Chem Lett 18:6231-5 (2008)  
Target
Name:
Proto-oncogene tyrosine-protein kinase Src
Synonyms:
Calmodulin/Proto-oncogene tyrosine-protein kinase Src Proto-oncogene c-Src SRC SRC_HUMAN V-src sarcoma (Schmidt-Ruppin A-2) viral oncogene homolog (avian) p60-Src | pp60c-src
Type:
Protein
Mol. Mass.:
59838.60
Organism:
Homo sapiens (Human)
Description:
P12931
Residue:
536
  
Inhibitor
Name:
BDBM50249356
Synonyms:
CHEMBL453217 | N-(3,5-dimethylphenyl)-4-(4-methylthiazol-2-yl)pyrimidin-2-amine
Type:
Small organic molecule
Emp. Form.:
C16H16N4S
Mol. Mass.:
296.39
SMILES:
Cc1csc(n1)-c1ccnc(Nc2cc(C)cc(C)c2)n1
: