Target
Tyrosine-protein kinase SYK
Ligand
BDBM50276015
Substrate
Meas. Tech.
ChEMBL_492921 (CHEMBL945309)
Ki
8±n/a nM
Citation
 Farmer, LJBemis, GBritt, SDCochran, JConnors, MHarrington, EMHoock, TMarkland, WNanthakumar, STaslimi, PTer Haar, EWang, JZhaveri, DSalituro, FG Discovery and SAR of novel 4-thiazolyl-2-phenylaminopyrimidines as potent inhibitors of spleen tyrosine kinase (SYK). Bioorg Med Chem Lett 18:6231-5 (2008)  
Target
Name:
Tyrosine-protein kinase SYK
Synonyms:
KSYK_HUMAN Spleen Tyrosine Kinase Tyrosine-protein kinase SYK (Syk)
Type:
Enzyme
Mol. Mass.:
72079.99
Organism:
Homo sapiens (Human)
Description:
P43405
Residue:
635
  
Inhibitor
Name:
BDBM50276015
Synonyms:
CHEMBL509161 | N-(3,5-dimethylphenyl)-4-(thiazol-2-yl)pyrimidin-2-amine
Type:
Small organic molecule
Emp. Form.:
C15H14N4S
Mol. Mass.:
282.363
SMILES:
Cc1cc(C)cc(Nc2nccc(n2)-c2nccs2)c1
: