Target
Tyrosine-protein kinase ZAP-70
Ligand
BDBM50275935
Substrate
Meas. Tech.
ChEMBL_492925 (CHEMBL945313)
Ki
240±n/a nM
Citation
 Farmer, LJBemis, GBritt, SDCochran, JConnors, MHarrington, EMHoock, TMarkland, WNanthakumar, STaslimi, PTer Haar, EWang, JZhaveri, DSalituro, FG Discovery and SAR of novel 4-thiazolyl-2-phenylaminopyrimidines as potent inhibitors of spleen tyrosine kinase (SYK). Bioorg Med Chem Lett 18:6231-5 (2008)  
Target
Name:
Tyrosine-protein kinase ZAP-70
Synonyms:
70 kDa zeta-associated protein Syk-related tyrosine kinase Tyrosine-protein kinase ZAP-70 Tyrosine-protein kinase ZAP-70 (ZAP70) ZAP70 Zeta-chain (TCR) associated protein kinase 70kDa
Type:
Enzyme
Mol. Mass.:
69881.61
Organism:
Homo sapiens (Human)
Description:
ZAP-70 SH2 domain was expressed and purified from E. coli using O-phospho-L-tyrosine-agarose column.
Residue:
619
  
Inhibitor
Name:
BDBM50275935
Synonyms:
(S)-2-(2-(3,5-dimethylphenylamino)pyrimidin-4-yl)-N-(1-hydroxypropan-2-yl)-4-methylthiazole-5-carboxamide CHEMBL512172
Type:
Small organic molecule
Emp. Form.:
C20H23N5O2S
Mol. Mass.:
397.494
SMILES:
C[C@@H](CO)NC(=O)c1sc(nc1C)-c1ccnc(Nc2cc(C)cc(C)c2)n1
: