Target
Protein-tyrosine kinase 2-beta
Ligand
BDBM50246286
Substrate
Meas. Tech.
ChEMBL_558214 (CHEMBL960612)
IC50
35±n/a nM
Citation
 Walker, DPBi, FCKalgutkar, ASBauman, JNZhao, SXSoglia, JRAspnes, GEKung, DWKlug-McLeod, JZawistoski, MPMcGlynn, MAOliver, RDunn, MLi, JCRichter, DTCooper, BAKath, JCHulford, CAAutry, CLLuzzio, MJUng, EJRoberts, WGBonnette, PCBuckbinder, LMistry, AGriffor, MCHan, SGuzman-Perez, A Trifluoromethylpyrimidine-based inhibitors of proline-rich tyrosine kinase 2 (PYK2): structure-activity relationships and strategies for the elimination of reactive metabolite formation. Bioorg Med Chem Lett 18:6071-7 (2008)  
Target
Name:
Protein-tyrosine kinase 2-beta
Synonyms:
FAK2 PTK2B PTK2B protein tyrosine kinase 2 beta (PTK2B) Protein tyrosine kinase 2 beta | RAFTK
Type:
Protein
Mol. Mass.:
115868.80
Organism:
Homo sapiens (Human)
Description:
Q14289
Residue:
1009
  
Inhibitor
Name:
BDBM50246286
Synonyms:
CHEMBL488247 | N-methyl-N-(2-((2-(4-(methylsulfonyl)phenylamino)-5-(trifluoromethyl)pyrimidin-4-ylamino)methyl)phenyl)methanesulfonamide
Type:
Small organic molecule
Emp. Form.:
C21H22F3N5O4S2
Mol. Mass.:
529.556
SMILES:
CN(c1ccccc1CNc1nc(Nc2ccc(cc2)S(C)(=O)=O)ncc1C(F)(F)F)S(C)(=O)=O
: