Target
Cytochrome P450 2D6
Ligand
BDBM50274978
Substrate
Meas. Tech.
ChEMBL_493419 (CHEMBL944376)
IC50
7500±n/a nM
Citation
 Bannwart, LMCarter, DSCai, HYChoy, JCGreenhouse, RJaime-Figueroa, SIyer, PSLin, CJLee, EKLucas, MCLynch, SMMadera, AMMoore, AOzboya, KRaptova, LRoetz, RSchoenfeld, RCStein, KASteiner, SVilla, MWeikert, RJZhai, Y Novel 3,3-disubstituted pyrrolidines as selective triple serotonin/norepinephrine/dopamine reuptake inhibitors. Bioorg Med Chem Lett 18:6062-6 (2008)  
Target
Name:
Cytochrome P450 2D6
Synonyms:
CP2D6_HUMAN CYP2DL1 Cytochrome P450 2D6 (CYP2D6) P450-DB1
Type:
Protein
Mol. Mass.:
55774.82
Organism:
Homo sapiens (Human)
Description:
P10635
Residue:
497
  
Inhibitor
Name:
BDBM50274978
Synonyms:
5-(3-propylpyrrolidin-3-yl)-1H-indole | CHEMBL463389
Type:
Small organic molecule
Emp. Form.:
C15H20N2
Mol. Mass.:
228.3327
SMILES:
CCCC1(CCNC1)c1ccc2[nH]ccc2c1
: