Target
Thyroid hormone receptor alpha
Ligand
BDBM50274810
Substrate
Meas. Tech.
ChEMBL_493724 (CHEMBL949479)
Ki
16±n/a nM
Citation
 Boyer, SHJiang, HJacintho, JDReddy, MVLi, HLi, WGodwin, JLSchulz, WGCable, EEHou, JWu, RFujitaki, JMHecker, SJErion, MD Synthesis and biological evaluation of a series of liver-selective phosphonic acid thyroid hormone receptor agonists and their prodrugs. J Med Chem 51:7075-93 (2009)  
Target
Name:
Thyroid hormone receptor alpha
Synonyms:
C-erbA-alpha EAR7 NR1A1 THA_HUMAN THRA1 Thyroid Hormone Receptor (TR-alpha) Thyroid hormone receptor alpha c-erbA-1
Type:
Receptor
Mol. Mass.:
54818.00
Organism:
Homo sapiens (Human)
Description:
Recombinant hThR was obtained from nuclear extracts from SF9 cells infected with baculovirus vectors encoding for ThRalpha 1.
Residue:
490
  
Inhibitor
Name:
BDBM50274810
Synonyms:
3,5-Diiodo-4-(4'-hydroxy-3'-iodophenoxy)benzylphosphonic Acid | CHEMBL459148
Type:
Small organic molecule
Emp. Form.:
C13H10I3O5P
Mol. Mass.:
657.9027
SMILES:
Oc1ccc(Oc2c(I)cc(CP(O)(O)=O)cc2I)cc1I
: