Target
Wee1-like protein kinase
Ligand
BDBM50279710
Substrate
Meas. Tech.
ChEMBL_522127 (CHEMBL1006579)
IC50
20±n/a nM
Citation
 Wichapong, KLindner, MPianwanit, SKokpol, SSippl, W Receptor-based 3D-QSAR studies of checkpoint Wee1 kinase inhibitors. Eur J Med Chem 44:1383-95 (2009)  
Target
Name:
Wee1-like protein kinase
Synonyms:
Serine/threonine-protein kinase WEE1 WEE1 homolog (S. pombe) | WEE1_HUMAN
Type:
PROTEIN
Mol. Mass.:
71599.12
Organism:
Homo sapiens (Human)
Description:
ChEMBL_1445054
Residue:
646
  
Inhibitor
Name:
BDBM50279710
Synonyms:
8-(3-(1H-pyrrol-1-yl)propylthio)-4-(2-chlorophenyl)-9-hydroxy-6-methylpyrrolo[3,4-c]carbazole-1,3(2H,6H)-dione | CHEMBL474714
Type:
Small organic molecule
Emp. Form.:
C28H22ClN3O3S
Mol. Mass.:
516.011
SMILES:
Cn1c2cc(SCCCn3cccc3)c(O)cc2c2c3C(=O)NC(=O)c3c(cc12)-c1ccccc1Cl
: