Target
Wee1-like protein kinase
Ligand
BDBM50232242
Substrate
Meas. Tech.
ChEMBL_522127 (CHEMBL1006579)
IC50
26±n/a nM
Citation
 Wichapong, KLindner, MPianwanit, SKokpol, SSippl, W Receptor-based 3D-QSAR studies of checkpoint Wee1 kinase inhibitors. Eur J Med Chem 44:1383-95 (2009)  
Target
Name:
Wee1-like protein kinase
Synonyms:
Serine/threonine-protein kinase WEE1 WEE1 homolog (S. pombe) | WEE1_HUMAN
Type:
PROTEIN
Mol. Mass.:
71599.12
Organism:
Homo sapiens (Human)
Description:
ChEMBL_1445054
Residue:
646
  
Inhibitor
Name:
BDBM50232242
Synonyms:
4-(2-chlorophenyl)-8-(3-(dimethylamino)propoxy)-9-hydroxypyrrolo[3,4-c]carbazole-1,3(2H,6H)-dione | CHEMBL272479
Type:
Small organic molecule
Emp. Form.:
C25H22ClN3O4
Mol. Mass.:
463.913
SMILES:
CN(C)CCCOc1cc2[nH]c3cc(c4C(=O)NC(=O)c4c3c2cc1O)-c1ccccc1Cl
: